linuxulator:ltp

Differences

This shows you the differences between two versions of the page.

Link to this comparison view

Both sides previous revision Previous revision
Next revision
Previous revision
linuxulator:ltp [2007/01/15 06:06] – vfork passes for amd64 with linux32_machdep.c 1.26 ScotHetzellinuxulator:ltp [2022/09/19 01:52] (current) – Remove ACL: not devs only for a long time, all:read is already default KubilayKocak
Line 1: Line 1:
 ====== LTP tests ====== ====== LTP tests ======
-  * LTP version: 20061222+ 
 +  * LTP version: 20070630 (stable), 20061222 (-current)
   * in the 2.4.2 compatibility we have   * in the 2.4.2 compatibility we have
-    * ~160 failures (~20%) out of 814 counted tests (some are not run because they hang and it was a "non-interactive" run, so the real numbers are higher) for i386, stable +    * 158 failures (~19%) out of 833 tests for i386, stable (cvsup: ~20070903) 
-    * ~210 failures (~24%) out of 830 counted tests (some are not run because they hang and it was a "non-interactive" run, so the real numbers are higher) for amd64, stable +    * 169 failures (~20%) out of 833 tests for amd64, stable (cvsup: ~20070903) 
-    * ~130 failures (~16%) out of 831 tests for i386, current (cvsup: 20061222) +    * 124 failures (~15%) out of 831 tests for i386, current (cvsup: 20070121) 
-    * 140 failures (~17%) out of 831 tests for amd64, current (cvsup: 20070114)+    * 135 failures (~16%) out of 831 tests for amd64, current (cvsup: 20070501)
   * in the 2.6.16 compatibility we have   * in the 2.6.16 compatibility we have
-    * 143 failures (~17%) out of 831 tests for i386, current (cvsup: 20061222) +    * 136 failures (~16%) out of 831 tests for i386, current (cvsup: 20070121) 
-    * 153 failures (~18%) out of 831 tests for amd64, current (cvsup: 20070114)+    * 147 failures (~17%) out of 831 tests for amd64, current (cvsup: 20070501)
   * major problems:   * major problems:
     * -<del>several tests blocked in fifoor state, e.g., dup05, read03, select03, ...; they need to be killed with -9</del>-: fixed in -current     * -<del>several tests blocked in fifoor state, e.g., dup05, read03, select03, ...; they need to be killed with -9</del>-: fixed in -current
Line 16: Line 17:
 |  |  **stable**  ||  **current**  ||  **current**  ||  | |  |  **stable**  ||  **current**  ||  **current**  ||  |
 |  |  **i386**  |  **amd64**  |  **i386**  |  **amd64**  |  **i386**  |  **amd64**  |  | |  |  **i386**  |  **amd64**  |  **i386**  |  **amd64**  |  **i386**  |  **amd64**  |  |
-|  |    |    |  20070114  |  20070114  |  20070114  |  20070114  | rough date of the cvsup |+|  |  20070903  |  20070903  |  20070121  |  20070501  |  20070121  |  20070501  | rough date of the cvsup |
 | //syscall tests// |||||||| | //syscall tests// ||||||||
 | abort01 | FAIL | FAIL | FAIL | FAIL | FAIL | FAIL | Child did not return core bit set! | | abort01 | FAIL | FAIL | FAIL | FAIL | FAIL | FAIL | Child did not return core bit set! |
-| accept01 | FAIL | FAIL | FAIL | FAIL | FAIL | FAIL | test 7 UDP accept returned -1 (expected -1), errno 22 (expected 95) |+| accept01 | PASS | PASS | FAIL | FAIL | FAIL | FAIL | -<del>test 7 UDP accept returned -1 (expected -1), errno 22 (expected 95)</del>- should be fixed, needs confirmation for -current |
 | access01 | PASS | PASS | PASS | PASS | PASS | PASS |  | | access01 | PASS | PASS | PASS | PASS | PASS | PASS |  |
 | access02 | PASS | PASS | PASS | PASS | PASS | PASS |  | | access02 | PASS | PASS | PASS | PASS | PASS | PASS |  |
-| access03 | PASS | FAIL | PASS | PASS | PASS | PASS |  |+| access03 | PASS | PASS | PASS | PASS | PASS | PASS |  |
 | access04 | PASS | PASS | PASS | PASS | PASS | PASS |  | | access04 | PASS | PASS | PASS | PASS | PASS | PASS |  |
-| access05 | FAIL | FAIL | PASS | PASS | PASS | PASS |  |+| access05 | PASS | PASS | PASS | PASS | PASS | PASS |  |
 | acct01 | FAIL | FAIL | FAIL | FAIL | FAIL | FAIL | Attempt to use non-ordinary file didn't receive EACCESS error - received 2 | | acct01 | FAIL | FAIL | FAIL | FAIL | FAIL | FAIL | Attempt to use non-ordinary file didn't receive EACCESS error - received 2 |
 | acct02 | PASS | PASS | PASS | PASS | PASS | PASS |  | | acct02 | PASS | PASS | PASS | PASS | PASS | PASS |  |
Line 37: Line 38:
 | alarm07 | PASS | PASS | PASS | PASS | PASS | PASS |  | | alarm07 | PASS | PASS | PASS | PASS | PASS | PASS |  |
 | asyncio02 | PASS | PASS | PASS | PASS | PASS | PASS |  | | asyncio02 | PASS | PASS | PASS | PASS | PASS | PASS |  |
-| bind01 | FAIL | FAIL | PASS | PASS | PASS | PASS |  |+| bind01 | PASS | PASS | PASS | PASS | PASS | PASS |  |
 | bind02 | PASS | PASS | PASS | PASS | PASS | PASS |  | | bind02 | PASS | PASS | PASS | PASS | PASS | PASS |  |
 | brk01 | PASS | PASS | PASS | PASS | PASS | PASS |  | | brk01 | PASS | PASS | PASS | PASS | PASS | PASS |  |
Line 48: Line 49:
 | chdir02 | PASS | PASS | PASS | PASS | PASS | PASS |  | | chdir02 | PASS | PASS | PASS | PASS | PASS | PASS |  |
 | chdir03 | PASS | PASS | PASS | PASS | PASS | PASS |  | | chdir03 | PASS | PASS | PASS | PASS | PASS | PASS |  |
-| chdir04 | PASS | FAIL | PASS | PASS | PASS | PASS |  |+| chdir04 | PASS | PASS | PASS | PASS | PASS | PASS |  |
 | chmod01 | PASS | PASS | PASS | PASS | PASS | PASS |  | | chmod01 | PASS | PASS | PASS | PASS | PASS | PASS |  |
 | chmod01A | PASS | PASS | PASS | PASS | PASS | PASS |  | | chmod01A | PASS | PASS | PASS | PASS | PASS | PASS |  |
Line 55: Line 56:
 | chmod04 | PASS | PASS | PASS | PASS | PASS | PASS |  | | chmod04 | PASS | PASS | PASS | PASS | PASS | PASS |  |
 | chmod05 | PASS | PASS | PASS | PASS | PASS | PASS |  | | chmod05 | PASS | PASS | PASS | PASS | PASS | PASS |  |
-| chmod06 | PASS | FAIL | PASS | PASS | PASS | PASS |  |+| chmod06 | PASS | PASS | PASS | PASS | PASS | PASS |  |
 | chmod07 | PASS | PASS | PASS | PASS | PASS | PASS |  | | chmod07 | PASS | PASS | PASS | PASS | PASS | PASS |  |
 | chown01 | PASS | PASS | PASS | PASS | PASS | PASS |  | | chown01 | PASS | PASS | PASS | PASS | PASS | PASS |  |
 | chown02 | FAIL | FAIL | FAIL | FAIL | FAIL | FAIL | test 1 testfile1: Incorrect mode permissions 0106770, Expected 0100770 | | chown02 | FAIL | FAIL | FAIL | FAIL | FAIL | FAIL | test 1 testfile1: Incorrect mode permissions 0106770, Expected 0100770 |
 | chown03 | PASS | PASS | PASS | PASS | PASS | PASS |  | | chown03 | PASS | PASS | PASS | PASS | PASS | PASS |  |
-| chown04 | PASS | FAIL | PASS | PASS | PASS | PASS |+| chown04 | PASS | PASS | PASS | PASS | PASS | PASS |
 | chown05 | PASS | PASS | PASS | PASS | PASS | PASS |  | | chown05 | PASS | PASS | PASS | PASS | PASS | PASS |  |
 | chroot01 | PASS | PASS | PASS | PASS | PASS | PASS |  | | chroot01 | PASS | PASS | PASS | PASS | PASS | PASS |  |
 | chroot02 | PASS | PASS | PASS | PASS | PASS | PASS |  | | chroot02 | PASS | PASS | PASS | PASS | PASS | PASS |  |
-| chroot03 | PASS | FAIL | PASS | PASS | PASS | PASS |  |+| chroot03 | PASS | PASS | PASS | PASS | PASS | PASS |  |
 | chroot04 | FAIL | FAIL | FAIL | FAIL | FAIL | FAIL | expected EACCES - got 1 | | chroot04 | FAIL | FAIL | FAIL | FAIL | FAIL | FAIL | expected EACCES - got 1 |
 | clone01 | PASS | PASS | PASS | PASS | PASS | PASS |  | | clone01 | PASS | PASS | PASS | PASS | PASS | PASS |  |
Line 82: Line 83:
 | creat04 | PASS | PASS | PASS | PASS | PASS | PASS |  | | creat04 | PASS | PASS | PASS | PASS | PASS | PASS |  |
 | creat05 | PASS | PASS | PASS | PASS | PASS | PASS |  | | creat05 | PASS | PASS | PASS | PASS | PASS | PASS |  |
-| creat06 | PASS | FAIL | PASS | PASS | PASS | PASS |  |+| creat06 | PASS | PASS | PASS | PASS | PASS | PASS |  |
 | creat07 | FAIL | FAIL | FAIL | FAIL | FAIL | FAIL | execve() failed | | creat07 | FAIL | FAIL | FAIL | FAIL | FAIL | FAIL | execve() failed |
 | creat08 | FAIL | FAIL | FAIL | FAIL | FAIL | FAIL | short logile in results directory reports PASS, but in reality the verbose log shows failures: test 2 testdir.A.23971/nosetgid: Incorrect group --- test 3 testdir.A.23971/setgid: Incorrect modes, setgid bit not set --- test 4 testdir.A.23971/setgid: Incorrect group --- test 5 Test failed in block1 --- test 6 testdir.B.23971/setgid: Incorrect modes, setgid bit should be set --- test 7 Test failed in block2 --- test 9 Test failed because of above failures | | creat08 | FAIL | FAIL | FAIL | FAIL | FAIL | FAIL | short logile in results directory reports PASS, but in reality the verbose log shows failures: test 2 testdir.A.23971/nosetgid: Incorrect group --- test 3 testdir.A.23971/setgid: Incorrect modes, setgid bit not set --- test 4 testdir.A.23971/setgid: Incorrect group --- test 5 Test failed in block1 --- test 6 testdir.B.23971/setgid: Incorrect modes, setgid bit should be set --- test 7 Test failed in block2 --- test 9 Test failed because of above failures |
Line 142: Line 143:
 | fcntl11 | PASS | PASS | PASS | PASS | PASS | PASS |  | | fcntl11 | PASS | PASS | PASS | PASS | PASS | PASS |  |
 | fcntl12 | PASS | PASS | PASS | PASS | PASS | PASS |  | | fcntl12 | PASS | PASS | PASS | PASS | PASS | PASS |  |
-| fcntl13 | FAIL | FAIL | FAIL | FAIL | FAIL | FAIL | Expected EINVAL, got 9 |+| fcntl13 | FAIL | PASS | FAIL | FAIL | FAIL | FAIL | Expected EINVAL, got 9 |
 | fcntl14 | PASS | PASS | PASS | PASS | PASS | PASS |  | | fcntl14 | PASS | PASS | PASS | PASS | PASS | PASS |  |
 | fcntl15 | PASS | PASS | PASS | PASS | PASS | PASS |  | | fcntl15 | PASS | PASS | PASS | PASS | PASS | PASS |  |
Line 183: Line 184:
 | fstatat01 | PASS | PASS | PASS | PASS | FAIL | FAIL | new syscall in 2.6 | | fstatat01 | PASS | PASS | PASS | PASS | FAIL | FAIL | new syscall in 2.6 |
 | fstatfs01 | PASS | PASS | PASS | PASS | PASS | PASS |  | | fstatfs01 | PASS | PASS | PASS | PASS | PASS | PASS |  |
-| fstatfs02 | FAIL | FAIL | FAIL | FAIL | FAIL | FAIL | test 2 unexpected error - 22 : Invalid argument - expected 14 |+| fstatfs02 | FAIL | PASS | FAIL | FAIL | FAIL | FAIL | test 2 unexpected error - 22 : Invalid argument - expected 14 |
 | fsync01 | PASS | PASS | PASS | PASS | PASS | PASS |  | | fsync01 | PASS | PASS | PASS | PASS | PASS | PASS |  |
 | fsync02 | FAIL | FAIL | PASS | PASS | PASS | PASS | no message when FAIL; false negative, I got a "sync() succeeded in an acceptable amount of time" message, so I mark it as PASS for at least -current | | fsync02 | FAIL | FAIL | PASS | PASS | PASS | PASS | no message when FAIL; false negative, I got a "sync() succeeded in an acceptable amount of time" message, so I mark it as PASS for at least -current |
Line 248: Line 249:
 | ioperm01 | PASS | FAIL | PASS | FAIL | PASS | FAIL | amd64: syscall not implemented | | ioperm01 | PASS | FAIL | PASS | FAIL | PASS | FAIL | amd64: syscall not implemented |
 | ioperm02 | FAIL | FAIL | FAIL | FAIL | FAIL | FAIL | Unexpected results for Invalid I/O address returned 0 (expected -1), errno 0 (expected errno  22) --- amd64: syscall not implemented | | ioperm02 | FAIL | FAIL | FAIL | FAIL | FAIL | FAIL | Unexpected results for Invalid I/O address returned 0 (expected -1), errno 0 (expected errno  22) --- amd64: syscall not implemented |
-| iopl01 | PASS | FAIL | PASS | FAIL | PASS | FAIL | amd64: syscall not implemented | +| iopl01 | PASS | PASS | PASS | PASS | PASS | PASS |  | 
-| iopl02 | PASS | FAIL | PASS | FAIL | PASS | FAIL | amd64: syscall not implemented |+| iopl02 | PASS | PASS | PASS | PASS | PASS | PASS |  |
 | kill01 | PASS | PASS | PASS | PASS | PASS | PASS |  | | kill01 | PASS | PASS | PASS | PASS | PASS | PASS |  |
 | kill02 | PASS | PASS | PASS | PASS | PASS | PASS |  | | kill02 | PASS | PASS | PASS | PASS | PASS | PASS |  |
Line 263: Line 264:
 | kill12 | PASS | PASS | PASS | PASS | PASS | PASS |  | | kill12 | PASS | PASS | PASS | PASS | PASS | PASS |  |
 | lchown01 | PASS | PASS | PASS | PASS | PASS | PASS |  | | lchown01 | PASS | PASS | PASS | PASS | PASS | PASS |  |
-| lchown02 | PASS | FAIL | PASS | PASS | PASS | PASS |  |+| lchown02 | PASS | PASS | PASS | PASS | PASS | PASS |  |
 | link01 | FAIL | FAIL | FAIL | FAIL | FAIL | FAIL | symlink(object, symbolic) was succesful - A lstat of symbolic (ino:2481530) and of nick (ino:2481531), does not show them being the same ino. --- link(symbolic, "nick") failed, errno: 2: link of new file to object file via symbolic link file failed when expected not to | | link01 | FAIL | FAIL | FAIL | FAIL | FAIL | FAIL | symlink(object, symbolic) was succesful - A lstat of symbolic (ino:2481530) and of nick (ino:2481531), does not show them being the same ino. --- link(symbolic, "nick") failed, errno: 2: link of new file to object file via symbolic link file failed when expected not to |
 | link02 | PASS | PASS | PASS | PASS | PASS | PASS |  | | link02 | PASS | PASS | PASS | PASS | PASS | PASS |  |
 | link03 | PASS | PASS | PASS | PASS | PASS | PASS |  | | link03 | PASS | PASS | PASS | PASS | PASS | PASS |  |
-| link04 | PASS | FAIL | PASS | PASS | PASS | PASS |  |+| link04 | PASS | PASS | PASS | PASS | PASS | PASS |  |
 | link05 | PASS | PASS | PASS | PASS | PASS | PASS |  | | link05 | PASS | PASS | PASS | PASS | PASS | PASS |  |
 | link06 | PASS | PASS | PASS | PASS | PASS | PASS |  | | link06 | PASS | PASS | PASS | PASS | PASS | PASS |  |
Line 277: Line 278:
 | lseek01 | PASS | PASS | PASS | PASS | PASS | PASS |  | | lseek01 | PASS | PASS | PASS | PASS | PASS | PASS |  |
 | lseek02 | PASS | PASS | PASS | PASS | PASS | PASS |  | | lseek02 | PASS | PASS | PASS | PASS | PASS | PASS |  |
-| lseek03 | PASS | PASS | PASS | PASS | PASS | PASS |  |+| lseek03 | PASS | PASS | PASS | FAIL | PASS | FAIL | test 1 lseek(tfile_1554, 1, 4) Failed, errno=25 Inappropriate ioctl for device, expected 22(EINVAL) - This error occurs due to %%FreeBSD%%'s lseek is not returning EINVAL for filesystems that don't support SEEK_DATA(3) and SEEK_HOLE(4) since the addition of the ZFS filesystem. |
 | lseek04 | FAIL | FAIL | PASS | PASS | PASS | PASS |  | | lseek04 | FAIL | FAIL | PASS | PASS | PASS | PASS |  |
 | lseek05 | PASS | PASS | PASS | PASS | PASS | PASS |  | | lseek05 | PASS | PASS | PASS | PASS | PASS | PASS |  |
Line 287: Line 288:
 | lstat01A | PASS | PASS | PASS | PASS | PASS | PASS |  | | lstat01A | PASS | PASS | PASS | PASS | PASS | PASS |  |
 | lstat01 | PASS | PASS | PASS | PASS | PASS | PASS |  | | lstat01 | PASS | PASS | PASS | PASS | PASS | PASS |  |
-| lstat02 | PASS | FAIL | PASS | PASS | PASS | PASS |  |+| lstat02 | PASS | PASS | PASS | PASS | PASS | PASS |  |
 | lstat03 | PASS | PASS | PASS | PASS | PASS | PASS |  | | lstat03 | PASS | PASS | PASS | PASS | PASS | PASS |  |
 | mallopt01 | PASS | PASS | PASS | PASS | PASS | PASS |  | | mallopt01 | PASS | PASS | PASS | PASS | PASS | PASS |  |
Line 296: Line 297:
 | mlockall02 | PASS | PASS | PASS | PASS | PASS | PASS |  | | mlockall02 | PASS | PASS | PASS | PASS | PASS | PASS |  |
 | mlockall03 | PASS | PASS | PASS | PASS | FAIL | FAIL | new in 2.6 | | mlockall03 | PASS | PASS | PASS | PASS | FAIL | FAIL | new in 2.6 |
-| mkdir01 | PASS | FAIL | PASS | PASS | PASS | PASS |  |+| mkdir01 | PASS | PASS | PASS | PASS | PASS | PASS |  |
 | mkdir02 | FAIL | FAIL | FAIL | FAIL | FAIL | FAIL | test 1  mkdir() FAILED to inherit  the S_ISGID bit from parent directory --- test 2 Test to attempt to make a directory inherits group ID FAILED | | mkdir02 | FAIL | FAIL | FAIL | FAIL | FAIL | FAIL | test 1  mkdir() FAILED to inherit  the S_ISGID bit from parent directory --- test 2 Test to attempt to make a directory inherits group ID FAILED |
-| mkdir03 | PASS | FAIL | PASS | PASS | PASS | PASS |  |+| mkdir03 | PASS | PASS | PASS | PASS | PASS | PASS |  |
 | mkdir04 | PASS | PASS | PASS | PASS | PASS | PASS |  | | mkdir04 | PASS | PASS | PASS | PASS | PASS | PASS |  |
 | mkdir05 | PASS | PASS | PASS | PASS | PASS | PASS |  | | mkdir05 | PASS | PASS | PASS | PASS | PASS | PASS |  |
Line 304: Line 305:
 | mkdir08 | PASS | PASS | PASS | PASS | PASS | PASS |  | | mkdir08 | PASS | PASS | PASS | PASS | PASS | PASS |  |
 | mkdir09 | PASS | PASS | PASS | PASS | PASS | PASS |  | | mkdir09 | PASS | PASS | PASS | PASS | PASS | PASS |  |
-| mkdirat01 | PASS | FAIL | PASS | PASS | PASS | PASS |  | +| mkdirat01 | PASS | PASS | PASS | PASS | PASS | PASS |  | 
-| mknod01 | FAIL | FAIL | PASS | PASS | PASS | PASS |  |+| mknod01 | PASS | PASS | PASS | PASS | PASS | PASS |  |
 | mknod02 | FAIL | FAIL | FAIL | FAIL | FAIL | FAIL | tnode_18970: Incorrect group | | mknod02 | FAIL | FAIL | FAIL | FAIL | FAIL | FAIL | tnode_18970: Incorrect group |
 | mknod03 | FAIL | FAIL | PASS | PASS | PASS | PASS |  | | mknod03 | FAIL | FAIL | PASS | PASS | PASS | PASS |  |
Line 311: Line 312:
 | mknod05 | FAIL | FAIL | PASS | PASS | PASS | PASS |  | | mknod05 | FAIL | FAIL | PASS | PASS | PASS | PASS |  |
 | mknod06 | FAIL | FAIL | PASS | PASS | PASS | PASS |  | | mknod06 | FAIL | FAIL | PASS | PASS | PASS | PASS |  |
-| mknod07 | FAIL | FAIL | PASS | PASS | PASS | PASS |  |+| mknod07 | PASS | PASS | PASS | PASS | PASS | PASS |  |
 | mknod08 | FAIL | FAIL | FAIL | FAIL | FAIL | FAIL | tnode_18976: Incorrect group | | mknod08 | FAIL | FAIL | FAIL | FAIL | FAIL | FAIL | tnode_18976: Incorrect group |
-| mknod09 | FAIL | FAIL | PASS | PASS | PASS | PASS |  |+| mknod09 | PASS | PASS | PASS | PASS | PASS | PASS |  |
 | mknodat01 | PASS | PASS | PASS | PASS | FAIL | FAIL | new in 2.6 | | mknodat01 | PASS | PASS | PASS | PASS | FAIL | FAIL | new in 2.6 |
 | mlock01 | PASS | PASS | PASS | PASS | PASS | PASS |  | | mlock01 | PASS | PASS | PASS | PASS | PASS | PASS |  |
Line 322: Line 323:
 | mmap03 | PASS | PASS | PASS | PASS | PASS | PASS |  | | mmap03 | PASS | PASS | PASS | PASS | PASS | PASS |  |
 | mmap04 | PASS | PASS | PASS | PASS | PASS | PASS |  | | mmap04 | PASS | PASS | PASS | PASS | PASS | PASS |  |
-| mmap05 | PASS | FAIL | PASS | FAIL | PASS | FAIL | amd64: Mapped memory region with NO access is accessible |+| mmap05 | PASS | PASS | PASS | PASS | PASS | PASS |  |
 | mmap06 | PASS | PASS | PASS | PASS | PASS | PASS |  | | mmap06 | PASS | PASS | PASS | PASS | PASS | PASS |  |
 | mmap07 | PASS | PASS | PASS | PASS | PASS | PASS |  | | mmap07 | PASS | PASS | PASS | PASS | PASS | PASS |  |
Line 342: Line 343:
 | msgctl05 | FAIL | PASS | PASS | PASS | PASS | PASS |  | | msgctl05 | FAIL | PASS | PASS | PASS | PASS | PASS |  |
 | msgctl06 | FAIL | FAIL | PASS | PASS | PASS | PASS |  | | msgctl06 | FAIL | FAIL | PASS | PASS | PASS | PASS |  |
-| msgctl07 | FAIL | FAIL | PASS | PASS | PASS | PASS |  |+| msgctl07 | PASS | FAIL | PASS | PASS | PASS | PASS |  |
 | msgctl08 | FAIL | FAIL | PASS | PASS | PASS | PASS |  | | msgctl08 | FAIL | FAIL | PASS | PASS | PASS | PASS |  |
 | msgctl09 | FAIL | FAIL | PASS | PASS | PASS | PASS |  | | msgctl09 | FAIL | FAIL | PASS | PASS | PASS | PASS |  |
 | msgget01 | FAIL | FAIL | PASS | PASS | PASS | PASS |  | | msgget01 | FAIL | FAIL | PASS | PASS | PASS | PASS |  |
 | msgget02 | FAIL | PASS | PASS | PASS | PASS | PASS |  | | msgget02 | FAIL | PASS | PASS | PASS | PASS | PASS |  |
-| msgget03 | FAIL | FAIL | PASS | PASS | PASS | PASS |  |+| msgget03 | PASS | PASS | PASS | PASS | PASS | PASS |  |
 | msgget04 | FAIL | FAIL | PASS | PASS | PASS | PASS |  | | msgget04 | FAIL | FAIL | PASS | PASS | PASS | PASS |  |
 | msgrcv01 | FAIL | FAIL | PASS | PASS | PASS | PASS |  | | msgrcv01 | FAIL | FAIL | PASS | PASS | PASS | PASS |  |
Line 353: Line 354:
 | msgrcv03 | FAIL | FAIL | PASS | PASS | PASS | PASS |  | | msgrcv03 | FAIL | FAIL | PASS | PASS | PASS | PASS |  |
 | msgrcv04 | FAIL | FAIL | PASS | PASS | PASS | PASS |  | | msgrcv04 | FAIL | FAIL | PASS | PASS | PASS | PASS |  |
-| msgrcv05 | FAIL | PASS | PASS | PASS | PASS | PASS |  |+| msgrcv05 | FAIL | FAIL | PASS | PASS | PASS | PASS |  |
 | msgrcv06 | FAIL | FAIL | PASS | PASS | PASS | PASS |  | | msgrcv06 | FAIL | FAIL | PASS | PASS | PASS | PASS |  |
 | msgsnd01 | FAIL | FAIL | PASS | PASS | PASS | PASS |  | | msgsnd01 | FAIL | FAIL | PASS | PASS | PASS | PASS |  |
 | msgsnd02 | FAIL | FAIL | PASS | PASS | PASS | PASS |  | | msgsnd02 | FAIL | FAIL | PASS | PASS | PASS | PASS |  |
 | msgsnd03 | FAIL | FAIL | PASS | PASS | PASS | PASS |  | | msgsnd03 | FAIL | FAIL | PASS | PASS | PASS | PASS |  |
-| msgsnd04 | FAIL | PASS | PASS | PASS | PASS | PASS |  |+| msgsnd04 | FAIL | FAIL | PASS | PASS | PASS | PASS |  |
 | msgsnd05 | FAIL | FAIL | PASS | PASS | PASS | PASS |  | | msgsnd05 | FAIL | FAIL | PASS | PASS | PASS | PASS |  |
-| msgsnd06 | ??? | FAIL | PASS | PASS | PASS | PASS |  |+| msgsnd06 | FAIL | FAIL | PASS | PASS | PASS | PASS |  |
 | msync01 | PASS | PASS | PASS | PASS | PASS | PASS |  | | msync01 | PASS | PASS | PASS | PASS | PASS | PASS |  |
 | msync02 | PASS | PASS | PASS | PASS | PASS | PASS |  | | msync02 | PASS | PASS | PASS | PASS | PASS | PASS |  |
Line 392: Line 393:
 | open06 | PASS | PASS | PASS | PASS | PASS | PASS |  | | open06 | PASS | PASS | PASS | PASS | PASS | PASS |  |
 | open07 | FAIL | FAIL | FAIL | FAIL | FAIL | FAIL | test 1, 3, 5, 7 call succeeded unexpectedly --- test 2, 4, 6, 8 open returned unexpected errno, expected: 40, got: 0 | | open07 | FAIL | FAIL | FAIL | FAIL | FAIL | FAIL | test 1, 3, 5, 7 call succeeded unexpectedly --- test 2, 4, 6, 8 open returned unexpected errno, expected: 40, got: 0 |
-| open08 | FAIL | FAIL | FAIL | FAIL | FAIL | FAIL | test 3 call succeeded unexpectedly --- test 6 unexpected error - 2 : No such file or directory - expected 14 |+| open08 | FAIL | FAIL | PASS | PASS | PASS | PASS |  |
 | open09 | PASS | PASS | PASS | PASS | PASS | PASS |  | | open09 | PASS | PASS | PASS | PASS | PASS | PASS |  |
 | open10 | FAIL | FAIL | FAIL | FAIL | FAIL | FAIL | test 2 open10.testdir.A.43711/nosetgid: Incorrect group --- test 3 open10.testdir.A.43711/setgid: Incorrect modes, setgid bit not set --- test 4 open10.testdir.A.43711/setgid: Incorrect group --- test 5 Test failed in block1. --- test 6 open10.testdir.B.43711/setgid: Incorrect modes, setgid bit not set --- test 7 Test failed in block2 --- test 9 Test failed because of above failures. | | open10 | FAIL | FAIL | FAIL | FAIL | FAIL | FAIL | test 2 open10.testdir.A.43711/nosetgid: Incorrect group --- test 3 open10.testdir.A.43711/setgid: Incorrect modes, setgid bit not set --- test 4 open10.testdir.A.43711/setgid: Incorrect group --- test 5 Test failed in block1. --- test 6 open10.testdir.B.43711/setgid: Incorrect modes, setgid bit not set --- test 7 Test failed in block2 --- test 9 Test failed because of above failures. |
Line 406: Line 407:
 | pipe02 | PASS | PASS | PASS | PASS | PASS | PASS |  | | pipe02 | PASS | PASS | PASS | PASS | PASS | PASS |  |
 | pipe03 | FAIL | FAIL | FAIL | FAIL | FAIL | FAIL | test 1 success when writing to read end of pipe ret=1, errno=0 --- test 2 success when reading from write end of pipe ret=1, errno=0 | | pipe03 | FAIL | FAIL | FAIL | FAIL | FAIL | FAIL | test 1 success when writing to read end of pipe ret=1, errno=0 --- test 2 success when reading from write end of pipe ret=1, errno=0 |
-| pipe04 | PASS | PASS | PASS | PASS | PASS | PASS |  |+| pipe04 | PASS | PASS | PASS | PASS | PASS | PASS | may fail, this is realated to "kerpn.ipc.maxpipekva exceeded" and you should increase the kernel resources |
 | pipe05 | PASS | PASS | PASS | PASS | PASS | PASS |  | | pipe05 | PASS | PASS | PASS | PASS | PASS | PASS |  |
 | pipe06 | FAIL | FAIL | FAIL | FAIL | FAIL | FAIL | got unexpected error - 12, perhaps because console-msg:"kern.ipc.maxpipekva exceeded" | | pipe06 | FAIL | FAIL | FAIL | FAIL | FAIL | FAIL | got unexpected error - 12, perhaps because console-msg:"kern.ipc.maxpipekva exceeded" |
Line 419: Line 420:
 | pread01 | PASS | PASS | PASS | PASS | PASS | PASS |  | | pread01 | PASS | PASS | PASS | PASS | PASS | PASS |  |
 | pread02 | PASS | FAIL | PASS | FAIL | PASS | FAIL | amd64: test 2 pread() returned 0, expected -1, errno:22 | | pread02 | PASS | FAIL | PASS | FAIL | PASS | FAIL | amd64: test 2 pread() returned 0, expected -1, errno:22 |
-| pread03 | FAIL | FAIL | PASS | PASS | PASS | PASS |  |+| pread03 | PASS | PASS | PASS | PASS | PASS | PASS |  |
 | profil01 | PASS | FAIL | PASS | FAIL | PASS | FAIL |  | | profil01 | PASS | FAIL | PASS | FAIL | PASS | FAIL |  |
 | pselect01 | PASS | PASS | PASS | PASS | PASS | PASS |  | | pselect01 | PASS | PASS | PASS | PASS | PASS | PASS |  |
Line 457: Line 458:
 | rename06 | PASS | PASS | PASS | PASS | PASS | PASS |  | | rename06 | PASS | PASS | PASS | PASS | PASS | PASS |  |
 | rename07 | PASS | PASS | PASS | PASS | PASS | PASS |  | | rename07 | PASS | PASS | PASS | PASS | PASS | PASS |  |
-| rename08 | PASS | FAIL | PASS | PASS | PASS | PASS |  |+| rename08 | PASS | PASS | PASS | PASS | PASS | PASS |  |
 | rename09 | PASS | PASS | PASS | PASS | PASS | PASS |  | | rename09 | PASS | PASS | PASS | PASS | PASS | PASS |  |
 | rename10 | PASS | PASS | PASS | PASS | PASS | PASS |  | | rename10 | PASS | PASS | PASS | PASS | PASS | PASS |  |
Line 465: Line 466:
 | renameat01 | PASS | PASS | PASS | PASS | FAIL | FAIL | new syscall in 2.6 | | renameat01 | PASS | PASS | PASS | PASS | FAIL | FAIL | new syscall in 2.6 |
 | rmdir01 | PASS | PASS | PASS | PASS | PASS | PASS |  | | rmdir01 | PASS | PASS | PASS | PASS | PASS | PASS |  |
-| rmdir02 | PASS | FAIL | PASS | PASS | PASS | PASS |  |+| rmdir02 | PASS | PASS | PASS | PASS | PASS | PASS |  |
 | rmdir03 | PASS | PASS | PASS | PASS | PASS | PASS |  | | rmdir03 | PASS | PASS | PASS | PASS | PASS | PASS |  |
 | rmdir03A | PASS | PASS | PASS | PASS | PASS | PASS |  | | rmdir03A | PASS | PASS | PASS | PASS | PASS | PASS |  |
 | rmdir04 | PASS | PASS | PASS | PASS | PASS | PASS |  | | rmdir04 | PASS | PASS | PASS | PASS | PASS | PASS |  |
-| rmdir05 | PASS | FAIL | PASS | PASS | PASS | PASS |  |+| rmdir05 | PASS | PASS | PASS | PASS | PASS | PASS |  |
 | sbrk01 | PASS | PASS | PASS | PASS | PASS | PASS |  | | sbrk01 | PASS | PASS | PASS | PASS | PASS | PASS |  |
 | sched_get_priority_max01 | FAIL | FAIL | FAIL | FAIL | FAIL | FAIL | test 1 Test for SCHED_OTHER Failed,sched_get_priority_max() returned 63 errno = 0 : Success --- test 2 Test for SCHED_FIFO Failed,sched_get_priority_max() returned 31 errno = 0 : Success --- test 3 Test for SCHED_RR Failed,sched_get_priority_max() returned 31 errno = 0 : Success | | sched_get_priority_max01 | FAIL | FAIL | FAIL | FAIL | FAIL | FAIL | test 1 Test for SCHED_OTHER Failed,sched_get_priority_max() returned 63 errno = 0 : Success --- test 2 Test for SCHED_FIFO Failed,sched_get_priority_max() returned 31 errno = 0 : Success --- test 3 Test for SCHED_RR Failed,sched_get_priority_max() returned 31 errno = 0 : Success |
Line 476: Line 477:
 | sched_get_priority_min02 | PASS | PASS | PASS | PASS | PASS | PASS |  | | sched_get_priority_min02 | PASS | PASS | PASS | PASS | PASS | PASS |  |
 | sched_getparam01 | FAIL | PASS | PASS | FAIL | PASS | FAIL |  | | sched_getparam01 | FAIL | PASS | PASS | FAIL | PASS | FAIL |  |
-| sched_getparam02 | FAIL | PASS | FAIL | FAIL | FAIL | FAIL | Test Failed |+| sched_getparam02 | FAIL | FAIL | FAIL | FAIL | FAIL | FAIL | Test Failed |
 | sched_getparam03 | FAIL | FAIL | FAIL | FAIL | FAIL | FAIL | test 2 Call failed to produce expected error;  Expected errno: 22 Got : 3, No such process --- test 3 Call failed to produce expected error;  Expected errno: 22 Got : 14, Bad address | | sched_getparam03 | FAIL | FAIL | FAIL | FAIL | FAIL | FAIL | test 2 Call failed to produce expected error;  Expected errno: 22 Got : 3, No such process --- test 3 Call failed to produce expected error;  Expected errno: 22 Got : 14, Bad address |
 | sched_rr_get_interval01 | PASS | PASS | PASS | PASS | PASS | PASS |  | | sched_rr_get_interval01 | PASS | PASS | PASS | PASS | PASS | PASS |  |
Line 496: Line 497:
 | semctl01 | FAIL | FAIL | FAIL | FAIL | FAIL | FAIL | test 1 semaphore STAT info is incorrect --- test 2 semaphore mode info is incorrect --- test 3+8 semctl01 call failed - errno = 22 : Invalid argument --- ipc type 13 is not implemented --- ipc type 17 is not implemented, mostly fixed in p4 | | semctl01 | FAIL | FAIL | FAIL | FAIL | FAIL | FAIL | test 1 semaphore STAT info is incorrect --- test 2 semaphore mode info is incorrect --- test 3+8 semctl01 call failed - errno = 22 : Invalid argument --- ipc type 13 is not implemented --- ipc type 17 is not implemented, mostly fixed in p4 |
 | semctl02 | PASS | PASS | PASS | PASS | PASS | PASS |  | | semctl02 | PASS | PASS | PASS | PASS | PASS | PASS |  |
-| semctl03 | FAIL | FAIL | FAIL | FAIL | FAIL | FAIL | test 3 unexpected error - 22 : Invalid argument --- ipc type -257 is not implemented --- ipc type 13 is not implemented, fixed in p4 |+| semctl03 | FAIL | FAIL | PASS | PASS | PASS | PASS |  |
 | semctl04 | PASS | PASS | PASS | PASS | PASS | PASS |  | | semctl04 | PASS | PASS | PASS | PASS | PASS | PASS |  |
-| semctl05 | FAIL | FAIL | FAIL | FAIL | FAIL | FAIL | test 2 unexpected error - 22 : Invalid argument --- ipc type 17 is not implemented --- ipc type 13 is not implemented, fixed in p4 | +| semctl05 | FAIL | FAIL | PASS | PASS | PASS | PASS |  | 
-| semctl06 | FAIL | FAIL | FAIL | FAIL | FAIL | FAIL | all 7 tests failed --- ipc type 13 is not implemented, fixed in p4 |+| semctl06 | FAIL | FAIL | PASS | PASS | PASS | PASS |  |
 | semctl07 | PASS | PASS | PASS | PASS | PASS | PASS |  | | semctl07 | PASS | PASS | PASS | PASS | PASS | PASS |  |
 | semget01 | PASS | PASS | PASS | PASS | PASS | PASS |  | | semget01 | PASS | PASS | PASS | PASS | PASS | PASS |  |
Line 506: Line 507:
 | semget05 | FAIL | FAIL | PASS | PASS | PASS | PASS |  | | semget05 | FAIL | FAIL | PASS | PASS | PASS | PASS |  |
 | semget06 | PASS | PASS | PASS | PASS | PASS | PASS |  | | semget06 | PASS | PASS | PASS | PASS | PASS | PASS |  |
-| semop01 | FAIL | FAIL | FAIL | FAIL | FAIL | FAIL | semctl() failed in functional test --- ipc type 13 is not implemented |+| semop01 | FAIL | FAIL | PASS | PASS | PASS | PASS |  |
 | semop02 | FAIL | FAIL | FAIL | FAIL | FAIL | FAIL | test 4 call succeeded unexpectedly | | semop02 | FAIL | FAIL | FAIL | FAIL | FAIL | FAIL | test 4 call succeeded unexpectedly |
 | semop03 | PASS | PASS | PASS | PASS | PASS | PASS |  | | semop03 | PASS | PASS | PASS | PASS | PASS | PASS |  |
Line 547: Line 548:
 | setpriority02 | PASS | PASS | PASS | PASS | PASS | PASS |  | | setpriority02 | PASS | PASS | PASS | PASS | PASS | PASS |  |
 | setpriority03 | PASS | PASS | PASS | PASS | PASS | PASS |  | | setpriority03 | PASS | PASS | PASS | PASS | PASS | PASS |  |
-| setpriority04 | FAIL | FAIL | PASS | PASS | PASS | PASS |  |+| setpriority04 | PASS | PASS | PASS | PASS | PASS | PASS |  |
 | setpriority05 | PASS | PASS | PASS | PASS | PASS | PASS |  | | setpriority05 | PASS | PASS | PASS | PASS | PASS | PASS |  |
 | setregid01 | PASS | PASS | PASS | PASS | PASS | PASS |  | | setregid01 | PASS | PASS | PASS | PASS | PASS | PASS |  |
Line 569: Line 570:
 | setrlimit03 | FAIL | FAIL | FAIL | FAIL | FAIL | FAIL | call succeeded unexpectedly; fixed in p4 | | setrlimit03 | FAIL | FAIL | FAIL | FAIL | FAIL | FAIL | call succeeded unexpectedly; fixed in p4 |
 | setsid01 | PASS | PASS | PASS | PASS | PASS | PASS |  | | setsid01 | PASS | PASS | PASS | PASS | PASS | PASS |  |
-| setsockopt01 | FAIL | FAIL | PASS | PASS | PASS | PASS |  | +| setsockopt01 | PASS | PASS | PASS | PASS | PASS | PASS |  | 
-| settimeofday01 | PASS | FAIL | PASS | FAIL | PASS | FAIL | amd64: syscall not implemented | +| settimeofday01 | PASS | FAIL | PASS | PASS | PASS | PASS |  | 
-| settimeofday02 | PASS | FAIL | PASS | FAIL | PASS | FAIL | amd64: syscall not implemented |+| settimeofday02 | PASS | FAIL | PASS | PASS | PASS | PASS |  |
 | setuid01 | PASS | PASS | PASS | PASS | PASS | PASS |  | | setuid01 | PASS | PASS | PASS | PASS | PASS | PASS |  |
 | setuid02 | PASS | PASS | PASS | PASS | PASS | PASS |  | | setuid02 | PASS | PASS | PASS | PASS | PASS | PASS |  |
Line 587: Line 588:
 | shmget02 | PASS | PASS | PASS | PASS | PASS | PASS |  | | shmget02 | PASS | PASS | PASS | PASS | PASS | PASS |  |
 | shmget03 | PASS | PASS | PASS | PASS | PASS | PASS |  | | shmget03 | PASS | PASS | PASS | PASS | PASS | PASS |  |
-| shmget04 | PASS | PASS | PASS | PASS | PASS | PASS |  |+| shmget04 | PASS | PASS | PASS | FAIL | PASS | FAIL | amd64: test 1 call succeeded when error expected |
 | shmget05 | PASS | PASS | PASS | PASS | PASS | PASS |  | | shmget05 | PASS | PASS | PASS | PASS | PASS | PASS |  |
 | sigaction01 | PASS | ??? | PASS | FAIL | PASS | FAIL | amd64: fatal process exception: general protection fault, fault VA = 0x0 --- Segmentation fault (core dumped) | | sigaction01 | PASS | ??? | PASS | FAIL | PASS | FAIL | amd64: fatal process exception: general protection fault, fault VA = 0x0 --- Segmentation fault (core dumped) |
Line 614: Line 615:
 | stat01 | PASS | PASS | PASS | PASS | PASS | PASS |  | | stat01 | PASS | PASS | PASS | PASS | PASS | PASS |  |
 | stat02 | PASS | PASS | PASS | PASS | PASS | PASS |  | | stat02 | PASS | PASS | PASS | PASS | PASS | PASS |  |
-| stat03 | PASS | FAIL | PASS | PASS | PASS | PASS |  |+| stat03 | PASS | PASS | PASS | PASS | PASS | PASS |  |
 | stat04 | PASS | PASS | PASS | PASS | PASS | PASS |  | | stat04 | PASS | PASS | PASS | PASS | PASS | PASS |  |
 | stat05 | PASS | PASS | PASS | PASS | PASS | PASS |  | | stat05 | PASS | PASS | PASS | PASS | PASS | PASS |  |
-| stat06 | PASS | FAIL | PASS | PASS | PASS | PASS |  |+| stat06 | PASS | PASS | PASS | PASS | PASS | PASS |  |
 | statfs01 | PASS | PASS | PASS | PASS | PASS | PASS |  | | statfs01 | PASS | PASS | PASS | PASS | PASS | PASS |  |
-| statfs02 | PASS | FAIL | PASS | PASS | PASS | PASS |  |+| statfs02 | PASS | PASS | PASS | PASS | PASS | PASS |  |
 | statfs03 | PASS | PASS | PASS | PASS | PASS | PASS |  | | statfs03 | PASS | PASS | PASS | PASS | PASS | PASS |  |
 | statvfs01 | PASS | PASS | PASS | PASS | PASS | PASS |  | | statvfs01 | PASS | PASS | PASS | PASS | PASS | PASS |  |
Line 629: Line 630:
 | symlink01 | PASS | PASS | PASS | PASS | PASS | PASS |  | | symlink01 | PASS | PASS | PASS | PASS | PASS | PASS |  |
 | symlink02 | PASS | PASS | PASS | PASS | PASS | PASS |  | | symlink02 | PASS | PASS | PASS | PASS | PASS | PASS |  |
-| symlink03 | PASS | FAIL | PASS | PASS | PASS | PASS |  |+| symlink03 | PASS | PASS | PASS | PASS | PASS | PASS |  |
 | symlink04 | PASS | PASS | PASS | PASS | PASS | PASS |  | | symlink04 | PASS | PASS | PASS | PASS | PASS | PASS |  |
 | symlink05 | PASS | PASS | PASS | PASS | PASS | PASS |  | | symlink05 | PASS | PASS | PASS | PASS | PASS | PASS |  |
Line 641: Line 642:
 | sysctl04 | PASS | PASS | PASS | PASS | PASS | PASS |  | | sysctl04 | PASS | PASS | PASS | PASS | PASS | PASS |  |
 | sysctl05 | FAIL | FAIL | FAIL | FAIL | FAIL | FAIL | test 1 sysctl(2) returned unexpected errno, expected: 14, got: 20; sysctl 1,2 not implemented | | sysctl05 | FAIL | FAIL | FAIL | FAIL | FAIL | FAIL | test 1 sysctl(2) returned unexpected errno, expected: 14, got: 20; sysctl 1,2 not implemented |
-| sysfs01 | FAIL | FAIL | FAIL | FAIL | FAIL | FAIL | sysfs(2) Failed for option 1 and set errno to 38; syscall not implemented |+| sysfs01 | FAIL | FAIL | FAIL | FAIL | FAIL | FAIL | sysfs(2) Failed for option 1 and set errno to 38; syscall not implemented NOTE: When implemented 'kldload ext2fs' before running this test. |
 | sysfs02 | FAIL | FAIL | FAIL | FAIL | FAIL | FAIL | sysfs(2) Failed for option 2 and returned 38 as error number; syscall not implemented | | sysfs02 | FAIL | FAIL | FAIL | FAIL | FAIL | FAIL | sysfs(2) Failed for option 2 and returned 38 as error number; syscall not implemented |
 | sysfs03 | FAIL | FAIL | FAIL | FAIL | FAIL | FAIL | sysfs(2) Failed for option 3 and returned 38 as error number; syscall not implemented | | sysfs03 | FAIL | FAIL | FAIL | FAIL | FAIL | FAIL | sysfs(2) Failed for option 3 and returned 38 as error number; syscall not implemented |
Line 666: Line 667:
 | truncate01 | PASS | PASS | PASS | PASS | PASS | PASS |  | | truncate01 | PASS | PASS | PASS | PASS | PASS | PASS |  |
 | truncate02 | PASS | PASS | PASS | PASS | PASS | PASS |  | | truncate02 | PASS | PASS | PASS | PASS | PASS | PASS |  |
-| truncate03 | PASS | FAIL | PASS | PASS | PASS | PASS |  |+| truncate03 | PASS | PASS | PASS | PASS | PASS | PASS |  |
 | truncate04 | PASS | PASS | PASS | PASS | PASS | PASS |  | | truncate04 | PASS | PASS | PASS | PASS | PASS | PASS |  |
 | umask01 | PASS | PASS | PASS | PASS | PASS | PASS |  | | umask01 | PASS | PASS | PASS | PASS | PASS | PASS |  |
Line 677: Line 678:
 | unlink05 | PASS | PASS | PASS | PASS | PASS | PASS |  | | unlink05 | PASS | PASS | PASS | PASS | PASS | PASS |  |
 | unlink06 | PASS | PASS | PASS | PASS | PASS | PASS |  | | unlink06 | PASS | PASS | PASS | PASS | PASS | PASS |  |
-| unlink07 | PASS | FAIL | PASS | PASS | PASS | PASS |  |+| unlink07 | PASS | PASS | PASS | PASS | PASS | PASS |  |
 | unlink08 | PASS | PASS | PASS | PASS | PASS | PASS |  | | unlink08 | PASS | PASS | PASS | PASS | PASS | PASS |  |
 | unlinkat01 | PASS | PASS | PASS | PASS | FAIL | FAIL | new syscall in 2.6 | | unlinkat01 | PASS | PASS | PASS | PASS | FAIL | FAIL | new syscall in 2.6 |
Line 696: Line 697:
 | wait02 | PASS | PASS | PASS | PASS | PASS | PASS |  | | wait02 | PASS | PASS | PASS | PASS | PASS | PASS |  |
 | wait401 | PASS | PASS | PASS | PASS | PASS | PASS |  | | wait401 | PASS | PASS | PASS | PASS | PASS | PASS |  |
-| wait402 | FAIL | FAIL | PASS | PASS | PASS | PASS |  |+| wait402 | PASS | PASS | PASS | PASS | PASS | PASS |  |
 | waitpid01 | PASS | PASS | PASS | PASS | PASS | PASS |  | | waitpid01 | PASS | PASS | PASS | PASS | PASS | PASS |  |
 | waitpid02 | PASS | PASS | PASS | PASS | PASS | PASS |  | | waitpid02 | PASS | PASS | PASS | PASS | PASS | PASS |  |
 | waitpid03 | PASS | PASS | PASS | PASS | PASS | PASS |  | | waitpid03 | PASS | PASS | PASS | PASS | PASS | PASS |  |
-| waitpid04 | FAIL | FAIL | PASS | PASS | PASS | PASS |  |+| waitpid04 | PASS | PASS | PASS | PASS | PASS | PASS |  |
 | waitpid05 | PASS | PASS | PASS | PASS | PASS | PASS |  | | waitpid05 | PASS | PASS | PASS | PASS | PASS | PASS |  |
 | waitpid06 | PASS | PASS | PASS | PASS | PASS | PASS |  | | waitpid06 | PASS | PASS | PASS | PASS | PASS | PASS |  |
Line 712: Line 713:
 | write01 | PASS | PASS | PASS | PASS | PASS | PASS |  | | write01 | PASS | PASS | PASS | PASS | PASS | PASS |  |
 | write02 | PASS | PASS | PASS | PASS | PASS | PASS |  | | write02 | PASS | PASS | PASS | PASS | PASS | PASS |  |
-| write03 | PASS | FAIL | PASS | PASS | PASS | PASS |  |+| write03 | PASS | PASS | PASS | PASS | PASS | PASS |  |
 | write04 | FAIL | FAIL | PASS | PASS | PASS | PASS |  | | write04 | FAIL | FAIL | PASS | PASS | PASS | PASS |  |
-| write05 | PASS | FAIL | PASS | PASS | PASS | PASS |  |+| write05 | PASS | PASS | PASS | PASS | PASS | PASS |  |
 | writev01 | FAIL | FAIL | FAIL | FAIL | FAIL | FAIL | test 1 writev() failed unexpectedly | | writev01 | FAIL | FAIL | FAIL | FAIL | FAIL | FAIL | test 1 writev() failed unexpectedly |
-| writev02 | PASS | FAIL | PASS | PASS | PASS | PASS |  | +| writev02 | PASS | PASS | PASS | PASS | PASS | PASS |  | 
-| writev03 | FAIL | PASS | FAIL | FAIL | FAIL | FAIL | test 1-3 Got error EFAULT | +| writev03 | FAIL | FAIL | FAIL | FAIL | FAIL | FAIL | test 1-3 Got error EFAULT | 
-| writev04 | FAIL | PASS | FAIL | FAIL | FAIL | FAIL | test 1-3 Got error EFAULT | +| writev04 | FAIL | FAIL | FAIL | FAIL | FAIL | FAIL | test 1-3 Got error EFAULT | 
-| writev05 | PASS | FAIL | PASS | PASS | PASS | PASS |  |+| writev05 | PASS | PASS | PASS | PASS | PASS | PASS |  |
 | //syscall tests finished, functional tests follow// |||||||| | //syscall tests finished, functional tests follow// ||||||||
 | gf01 | PASS | PASS | PASS | PASS | PASS | PASS |  | | gf01 | PASS | PASS | PASS | PASS | PASS | PASS |  |
Line 751: Line 752:
 | gf29 | PASS | PASS | PASS | PASS | PASS | PASS |  | | gf29 | PASS | PASS | PASS | PASS | PASS | PASS |  |
 | gf30 | PASS | PASS | PASS | PASS | PASS | PASS |  | | gf30 | PASS | PASS | PASS | PASS | PASS | PASS |  |
-| rwtest01 | FAIL | PASS | FAIL | FAIL | FAIL | FAIL | too much content to list here | +| rwtest01 | PASS | PASS | FAIL | FAIL | FAIL | FAIL | too much content to list here | 
-| rwtest02 | FAIL | PASS | FAIL | FAIL | FAIL | FAIL | too much content to list here | +| rwtest02 | PASS | PASS | FAIL | FAIL | FAIL | FAIL | too much content to list here | 
-| rwtest03 | FAIL | PASS | FAIL | FAIL | FAIL | FAIL | too much content to list here | +| rwtest03 | PASS | PASS | FAIL | FAIL | FAIL | FAIL | too much content to list here | 
-| rwtest04 | FAIL | PASS | FAIL | FAIL | FAIL | FAIL | too much content to list here |+| rwtest04 | PASS | PASS | FAIL | FAIL | FAIL | FAIL | too much content to list here |
 | rwtest05 | PASS | PASS | PASS | PASS | PASS | PASS |  | | rwtest05 | PASS | PASS | PASS | PASS | PASS | PASS |  |
 | iogen01 | PASS | PASS | PASS | PASS | PASS | PASS |  | | iogen01 | PASS | PASS | PASS | PASS | PASS | PASS |  |
Line 827: Line 828:
 | pipeio_1 | PASS | PASS | PASS | PASS | PASS | PASS |  | | pipeio_1 | PASS | PASS | PASS | PASS | PASS | PASS |  |
 | pipeio_3 | PASS | PASS | PASS | PASS | PASS | PASS | may fail, this is realated to "kerpn.ipc.maxpipekva exceeded" and you should increase the kernel resources | | pipeio_3 | PASS | PASS | PASS | PASS | PASS | PASS | may fail, this is realated to "kerpn.ipc.maxpipekva exceeded" and you should increase the kernel resources |
-| pipeio_4 | PASS | PASS | PASS | PASS | PASS | PASS |  |+| pipeio_4 | PASS | PASS | PASS | PASS | PASS | PASS | there seems to be a race condition, sometimes there's a failure |
 | pipeio_5 | PASS | PASS | PASS | PASS | PASS | PASS |  | | pipeio_5 | PASS | PASS | PASS | PASS | PASS | PASS |  |
 | pipeio_6 | PASS | PASS | PASS | PASS | PASS | PASS |  | | pipeio_6 | PASS | PASS | PASS | PASS | PASS | PASS |  |
Line 850: Line 851:
 | ptem01 | FAIL | FAIL | FAIL | FAIL | FAIL | FAIL | /dev/ptmx | | ptem01 | FAIL | FAIL | FAIL | FAIL | FAIL | FAIL | /dev/ptmx |
 | hangup01 | FAIL | FAIL | FAIL | FAIL | FAIL | FAIL | open /dev/ptmx | | hangup01 | FAIL | FAIL | FAIL | FAIL | FAIL | FAIL | open /dev/ptmx |
 +| Containers | PASS | PASS |  |  |  |  |  |
  
  • linuxulator/ltp.1168841216.txt.gz
  • Last modified: 2007/01/15 06:06
  • by ScotHetzel